Reaction Details
TargetProtein kinase C theta type
LigandBDBM50057511
Substrate/Competitorn/a
Meas. Tech.ChEMBL_460216 (CHEMBL927266)
Ki 8.7±n/a nM
Citation Yanagita, RCNakagawa, YYamanaka, NKashiwagi, KSaito, NIrie, K Synthesis, conformational analysis, and biological evaluation of 1-hexylindolactam-V10 as a selective activator for novel protein kinase C isozymes. J Med Chem51:46-56 (2008) 
 
Protein kinase C theta type
Name:Protein kinase C theta type
Type:Serine/threonine-protein kinase
Mol. Mass.:81878.04
Organism:Homo sapiens (Human)
Description:Full-length human PKC theta (Panvera Catalog No. P2996).
Residue:706
BDBM50057511
NameBDBM50057511
Synonyms:(+/-)-indolactum-V 13-Hydroxymethyl-10-isopropyl-9-methyl-3,9,12-triaza-tricyclo[6.6.1.0*4,15*]pentadeca-1,4,6,8(15)-tetraen-11-one (10S,13S)-13-Hydroxymethyl-10-isopropyl-9-methyl-3,9,12-triaza-tricyclo[6.6.1.0*4,15*]pentadeca-1,4(15),5,7-tetraen-11-one (2S,5S)-5-(hydroxymethyl)-2-isopropyl-1-methyl-1,2,5,6-tetrahydro-4H-[1,4]diazonino[7,6,5-cd]indol-3(8H)-one 13-Hydroxymethyl-10-isopropyl-9-methyl-3,9,12-triaza-tricyclo[6.6.1.0*4,15*]pentadeca-1,4(15),5,7-tetraen-11-one CHEMBL27266 indolactam-V
TypeSmall organic molecule
Emp. Form.C17H23N3O2
Mol. Mass.301.3834
SMILESCC(C)[C@@H]1N(C)c2cccc3[nH]cc(C[C@@H](CO)NC1=O)c23