Reaction Details
TargetSodium-dependent serotonin transporter
LigandBDBM50230707
Substrate/Competitorn/a
Meas. Tech.ChEMBL_460400 (CHEMBL927452)
Ki 1.26±n/a nM
Citation Jarkas, NVoll, RJWilliams, LVotaw, JROwens, MGoodman, MM Synthesis and in vivo evaluation of halogenated N,N-dimethyl-2-(2'-amino-4'-hydroxymethylphenylthio)benzylamine derivatives as PET serotonin transporter ligands. J Med Chem51:271-81 (2008) 
 
Sodium-dependent serotonin transporter
Name:Sodium-dependent serotonin transporter
Type:Multi-pass membrane protein
Mol. Mass.:70322.51
Organism:Homo sapiens (Human)
Description:P31645
Residue:630
BDBM50230707
NameBDBM50230707
Synonyms:CHEMBL253182 | N,N-dimethyl-2-(2'-amino-4'-hydroxymethyl-phenylthio)-5-fluorobenzylamine
TypeSmall organic molecule
Emp. Form.C16H19FN2OS
Mol. Mass.306.398
SMILESCN(C)Cc1cc(F)ccc1Sc1ccc(CO)cc1N