Reaction Details
TargetTransient receptor potential cation channel subfamily V member 1
LigandBDBM50231051
Substrate/Competitorn/a
Meas. Tech.ChEMBL_461948 (CHEMBL944795)
IC50 120±n/a nM
Citation Shishido, YJinno, MIkeda, TIto, FSudo, MMakita, NOhta, AIki-Taki, AOhmi, TKanai, YTamura, TShimojo, M Synthesis of benzamide derivatives as TRPV1 antagonists. Bioorg Med Chem Lett18:1072-8 (2008) 
 
Transient receptor potential cation channel subfamily V member 1
Name:Transient receptor potential cation channel subfamily V member 1
Type:Protein
Mol. Mass.:94960.75
Organism:Homo sapiens (Human)
Description:Q8NER1
Residue:839
BDBM50231051
NameBDBM50231051
Synonyms:CHEMBL252226 | N-(4-tert-butylphenyl)-4-(trifluoromethoxy)benzamide
TypeSmall organic molecule
Emp. Form.C18H18F3NO2
Mol. Mass.337.3362
SMILESCC(C)(C)c1ccc(NC(=O)c2ccc(OC(F)(F)F)cc2)cc1