Reaction Details
TargetTransient receptor potential cation channel subfamily V member 1
LigandBDBM50231088
Substrate/Competitorn/a
Meas. Tech.ChEMBL_461948 (CHEMBL944795)
IC50 76±n/a nM
Citation Shishido, YJinno, MIkeda, TIto, FSudo, MMakita, NOhta, AIki-Taki, AOhmi, TKanai, YTamura, TShimojo, M Synthesis of benzamide derivatives as TRPV1 antagonists. Bioorg Med Chem Lett18:1072-8 (2008) 
 
Transient receptor potential cation channel subfamily V member 1
Name:Transient receptor potential cation channel subfamily V member 1
Type:Protein
Mol. Mass.:94960.75
Organism:Homo sapiens (Human)
Description:Q8NER1
Residue:839
BDBM50231088
NameBDBM50231088
Synonyms:CHEMBL253624 | N-(2-(4,7-dihydroxynaphthalen-1-yl)ethyl)-4-(trifluoromethoxy)benzamide
TypeSmall organic molecule
Emp. Form.C20H16F3NO4
Mol. Mass.391.3405
SMILESOc1ccc2c(O)ccc(CCNC(=O)c3ccc(OC(F)(F)F)cc3)c2c1