Reaction Details
TargetC-C chemokine receptor type 3
LigandBDBM50231346
Substrate/Competitorn/a
Meas. Tech.ChEMBL_461963 (CHEMBL945751)
IC50 0.4±n/a nM
Citation Gardner, DSSantella, JBTebben, AJBatt, DGKo, SSTraeger, SCWelch, PKWadman, EADavies, PCarter, PHDuncia, JV From rigid cyclic templates to conformationally stabilized acyclic scaffolds. Part II: Acyclic replacements for the (3S)-3-benzylpiperidine in a series of potent CCR3 antagonists. Bioorg Med Chem Lett18:586-95 (2008) 
 
C-C chemokine receptor type 3
Name:C-C chemokine receptor type 3
Type:Enzyme
Mol. Mass.:41053.88
Organism:Homo sapiens (Human)
Description:P51677
Residue:355
BDBM50231346
NameBDBM50231346
Synonyms:1-((2R,3S)-4-(ethyl(3-(4-fluorophenyl)propyl)amino)-3-hydroxybutan-2-yl)-3-(3-ethyl-5-(1-methyl-1H-tetrazol-5-yl)phenyl)urea | CHEMBL428062
TypeSmall organic molecule
Emp. Form.C26H36FN7O2
Mol. Mass.497.6081
SMILESCCN(CCCc1ccc(F)cc1)C[C@H](O)[C@@H](C)NC(=O)Nc1cc(CC)cc(c1)-c1nnnn1C