Reaction Details
TargetC-C chemokine receptor type 3
LigandBDBM50231358
Substrate/Competitorn/a
Meas. Tech.ChEMBL_461963 (CHEMBL945751)
IC50 0.3±n/a nM
Citation Gardner, DSSantella, JBTebben, AJBatt, DGKo, SSTraeger, SCWelch, PKWadman, EADavies, PCarter, PHDuncia, JV From rigid cyclic templates to conformationally stabilized acyclic scaffolds. Part II: Acyclic replacements for the (3S)-3-benzylpiperidine in a series of potent CCR3 antagonists. Bioorg Med Chem Lett18:586-95 (2008) 
 
C-C chemokine receptor type 3
Name:C-C chemokine receptor type 3
Type:Enzyme
Mol. Mass.:41053.88
Organism:Homo sapiens (Human)
Description:P51677
Residue:355
BDBM50231358
NameBDBM50231358
Synonyms:1-((2R,3S)-4-((S)-3-(4-fluorobenzyl)piperidin-1-yl)-3-hydroxybutan-2-yl)-3-(3-(1-methyl-1H-tetrazol-5-yl)phenyl)urea BMS-639623 | CHEMBL399495
TypeSmall organic molecule
Emp. Form.C25H32FN7O2
Mol. Mass.481.5657
SMILESC[C@@H](NC(=O)Nc1cccc(c1)-c1nnnn1C)[C@@H](O)CN1CCC[C@@H](Cc2ccc(F)cc2)C1