Reaction Details
TargetTransient receptor potential cation channel subfamily V member 1
LigandBDBM50232112
Substrate/Competitorn/a
Meas. Tech.ChEMBL_460851 (CHEMBL943866)
IC50 10±n/a nM
Citation Gomtsyan, ABayburt, EKSchmidt, RGSurowy, CSHonore, PMarsh, KCHannick, SMMcDonald, HAWetter, JMSullivan, JPJarvis, MFFaltynek, CRLee, CH Identification of (R)-1-(5-tert-butyl-2,3-dihydro-1H-inden-1-yl)-3-(1H-indazol-4-yl)urea (ABT-102) as a potent TRPV1 antagonist for pain management. J Med Chem51:392-5 (2008) 
 
Transient receptor potential cation channel subfamily V member 1
Name:Transient receptor potential cation channel subfamily V member 1
Type:Protein
Mol. Mass.:94960.75
Organism:Homo sapiens (Human)
Description:Q8NER1
Residue:839
BDBM50232112
NameBDBM50232112
Synonyms:1-(5-tert-butyl-2,3-dihydro-1H-inden-2-yl)-3-(1H-indazol-4-yl)urea | CHEMBL398834
TypeSmall organic molecule
Emp. Form.C21H24N4O
Mol. Mass.348.4415
SMILESCC(C)(C)c1ccc2CC(Cc2c1)NC(=O)Nc1cccc2[nH]ncc12