Reaction Details
TargetTransient receptor potential cation channel subfamily V member 1
LigandBDBM50232125
Substrate/Competitorn/a
Meas. Tech.ChEMBL_460851 (CHEMBL943866)
IC50 7±n/a nM
Citation Gomtsyan, ABayburt, EKSchmidt, RGSurowy, CSHonore, PMarsh, KCHannick, SMMcDonald, HAWetter, JMSullivan, JPJarvis, MFFaltynek, CRLee, CH Identification of (R)-1-(5-tert-butyl-2,3-dihydro-1H-inden-1-yl)-3-(1H-indazol-4-yl)urea (ABT-102) as a potent TRPV1 antagonist for pain management. J Med Chem51:392-5 (2008) 
 
Transient receptor potential cation channel subfamily V member 1
Name:Transient receptor potential cation channel subfamily V member 1
Type:Protein
Mol. Mass.:94960.75
Organism:Homo sapiens (Human)
Description:Q8NER1
Residue:839
BDBM50232125
NameBDBM50232125
Synonyms:1-(1H-Indazol-4-yl)-3-[4-(4-trifluoromethyl)piperidin-1-yl-indan-1-yl)-urea | CHEMBL401329
TypeSmall organic molecule
Emp. Form.C23H24F3N5O
Mol. Mass.443.4648
SMILESFC(F)(F)C1CCN(CC1)c1cccc2C(CCc12)NC(=O)Nc1cccc2[nH]ncc12