Reaction Details
Target5-hydroxytryptamine receptor 6
LigandBDBM34141
Substrate/Competitorn/a
Meas. Tech.ChEMBL_461019 (CHEMBL944975)
Ki 2.1±n/a nM
Citation Dukat, MMosier, PDKolanos, RRoth, BLGlennon, RA Binding of serotonin and N1-benzenesulfonyltryptamine-related analogs at human 5-HT6 serotonin receptors: receptor modeling studies. J Med Chem51:603-11 (2008) 
 
5-hydroxytryptamine receptor 6
Name:5-hydroxytryptamine receptor 6
Type:G Protein-Coupled Receptor (GPCR)
Mol. Mass.:46968.43
Organism:Homo sapiens (Human)
Description:P50406
Residue:440
BDBM34141
NameBDBM34141
Synonyms:CHEMBL76237 | MS-245
TypeSmall organic molecule
Emp. Form.C19H22N2O3S
Mol. Mass.358.455
SMILESCOc1ccc2n(cc(CCN(C)C)c2c1)S(=O)(=O)c1ccccc1