Reaction Details
TargetHistone deacetylase 1
LigandBDBM50232650
Substrate/Competitorn/a
Meas. Tech.ChEMBL_462156 (CHEMBL944984)
EC50 1000±n/a nM
Citation Fréchette, SLeit, SWoo, SHLapointe, GJeannotte, GMoradei, OPaquin, IBouchain, GRaeppel, SGaudette, FZhou, NVaisburg, AFournel, MYan, PTTrachy-Bourget, MCKalita, ARobert, MFLu, ARahil, JRobert Macleod, ABesterman, JMLi, ZDelorme, D 4-(Heteroarylaminomethyl)-N-(2-aminophenyl)-benzamides and their analogs as a novel class of histone deacetylase inhibitors. Bioorg Med Chem Lett18:1502-6 (2008) 
 
Histone deacetylase 1
Name:Histone deacetylase 1
Type:Enzyme
Mol. Mass.:55090.27
Organism:Homo sapiens (Human)
Description:Q13547
Residue:482
BDBM50232650
NameBDBM50232650
Synonyms:CHEMBL254519 | N-(2-aminophenyl)-4-((6-(2-morpholinoethoxy)benzo[d]thiazol-2-ylamino)methyl)benzamide
TypeSmall organic molecule
Emp. Form.C27H29N5O3S
Mol. Mass.503.616
SMILESNc1ccccc1NC(=O)c1ccc(CNc2nc3ccc(OCCN4CCOCC4)cc3s2)cc1