Reaction Details
TargetHistone deacetylase 1
LigandBDBM50232653
Substrate/Competitorn/a
Meas. Tech.ChEMBL_462153 (CHEMBL944981)
IC50 30±n/a nM
Citation Fréchette, SLeit, SWoo, SHLapointe, GJeannotte, GMoradei, OPaquin, IBouchain, GRaeppel, SGaudette, FZhou, NVaisburg, AFournel, MYan, PTTrachy-Bourget, MCKalita, ARobert, MFLu, ARahil, JRobert Macleod, ABesterman, JMLi, ZDelorme, D 4-(Heteroarylaminomethyl)-N-(2-aminophenyl)-benzamides and their analogs as a novel class of histone deacetylase inhibitors. Bioorg Med Chem Lett18:1502-6 (2008) 
 
Histone deacetylase 1
Name:Histone deacetylase 1
Type:Enzyme
Mol. Mass.:55090.27
Organism:Homo sapiens (Human)
Description:Q13547
Residue:482
BDBM50232653
NameBDBM50232653
Synonyms:CHEMBL403467 | N-(2-aminophenyl)-4-((6-methoxybenzo[d]thiazol-2-ylamino)methyl)benzamide
TypeSmall organic molecule
Emp. Form.C22H20N4O2S
Mol. Mass.404.485
SMILESCOc1ccc2nc(NCc3ccc(cc3)C(=O)Nc3ccccc3N)sc2c1