Reaction Details
TargetHistone deacetylase 1
LigandBDBM50232662
Substrate/Competitorn/a
Meas. Tech.ChEMBL_462153 (CHEMBL944981)
IC50 200±n/a nM
Citation Fréchette, SLeit, SWoo, SHLapointe, GJeannotte, GMoradei, OPaquin, IBouchain, GRaeppel, SGaudette, FZhou, NVaisburg, AFournel, MYan, PTTrachy-Bourget, MCKalita, ARobert, MFLu, ARahil, JRobert Macleod, ABesterman, JMLi, ZDelorme, D 4-(Heteroarylaminomethyl)-N-(2-aminophenyl)-benzamides and their analogs as a novel class of histone deacetylase inhibitors. Bioorg Med Chem Lett18:1502-6 (2008) 
 
Histone deacetylase 1
Name:Histone deacetylase 1
Type:Enzyme
Mol. Mass.:55090.27
Organism:Homo sapiens (Human)
Description:Q13547
Residue:482
BDBM50232662
NameBDBM50232662
Synonyms:CHEMBL253910 | N-(2-aminophenyl)-4-((5-(methylthio)-1H-1,2,4-triazol-3-ylamino)methyl)benzamide
TypeSmall organic molecule
Emp. Form.C17H18N6OS
Mol. Mass.354.429
SMILESCSc1nnc(NCc2ccc(cc2)C(=O)Nc2ccccc2N)[nH]1