Reaction Details
TargetHistone deacetylase 1
LigandBDBM50232649
Substrate/Competitorn/a
Meas. Tech.ChEMBL_462153 (CHEMBL944981)
IC50 70±n/a nM
Citation Fréchette, SLeit, SWoo, SHLapointe, GJeannotte, GMoradei, OPaquin, IBouchain, GRaeppel, SGaudette, FZhou, NVaisburg, AFournel, MYan, PTTrachy-Bourget, MCKalita, ARobert, MFLu, ARahil, JRobert Macleod, ABesterman, JMLi, ZDelorme, D 4-(Heteroarylaminomethyl)-N-(2-aminophenyl)-benzamides and their analogs as a novel class of histone deacetylase inhibitors. Bioorg Med Chem Lett18:1502-6 (2008) 
 
Histone deacetylase 1
Name:Histone deacetylase 1
Type:Enzyme
Mol. Mass.:55090.27
Organism:Homo sapiens (Human)
Description:Q13547
Residue:482
BDBM50232649
NameBDBM50232649
Synonyms:CHEMBL254310 | N-(2-aminophenyl)-4-((6-(pyridin-2-ylmethylamino)benzo[d]thiazol-2-ylthio)methyl)benzamide
TypeSmall organic molecule
Emp. Form.C27H23N5OS2
Mol. Mass.497.634
SMILESNc1ccccc1NC(=O)c1ccc(CSc2nc3ccc(NCc4ccccn4)cc3s2)cc1