Reaction Details
TargetHistone deacetylase 1
LigandBDBM50232651
Substrate/Competitorn/a
Meas. Tech.ChEMBL_462156 (CHEMBL944984)
EC50 3000±n/a nM
Citation Fréchette, SLeit, SWoo, SHLapointe, GJeannotte, GMoradei, OPaquin, IBouchain, GRaeppel, SGaudette, FZhou, NVaisburg, AFournel, MYan, PTTrachy-Bourget, MCKalita, ARobert, MFLu, ARahil, JRobert Macleod, ABesterman, JMLi, ZDelorme, D 4-(Heteroarylaminomethyl)-N-(2-aminophenyl)-benzamides and their analogs as a novel class of histone deacetylase inhibitors. Bioorg Med Chem Lett18:1502-6 (2008) 
 
Histone deacetylase 1
Name:Histone deacetylase 1
Type:Enzyme
Mol. Mass.:55090.27
Organism:Homo sapiens (Human)
Description:Q13547
Residue:482
BDBM50232651
NameBDBM50232651
Synonyms:CHEMBL253912 | N-(2-aminophenyl)-4-((benzo[d]thiazol-2-ylthio)methyl)benzamide
TypeSmall organic molecule
Emp. Form.C21H17N3OS2
Mol. Mass.391.509
SMILESNc1ccccc1NC(=O)c1ccc(CSc2nc3ccccc3s2)cc1