Reaction Details
TargetCytochrome P450 2C9
LigandBDBM50232842
Substrate/Competitorn/a
Meas. Tech.ChEMBL_461110 (CHEMBL945056)
Ki 101±n/a nM
Citation Hudelson, MGKetkar, NSHolder, LBCarlson, TJPeng, CCWaldher, BJJones, JP High confidence predictions of drug-drug interactions: predicting affinities for cytochrome P450 2C9 with multiple computational methods. J Med Chem51:648-54 (2008) 
 
Cytochrome P450 2C9
Name:Cytochrome P450 2C9
Type:Enzyme
Mol. Mass.:55636.33
Organism:Homo sapiens (Human)
Description:P11712
Residue:490
BDBM50232842
NameBDBM50232842
Synonyms:3-(3,5-dibromo-4-hydroxybenzoyl)-2-ethyl-4H-chromen-4-one | CHEMBL250251
TypeSmall organic molecule
Emp. Form.C18H12Br2O4
Mol. Mass.452.093
SMILESCCc1oc2ccccc2c(=O)c1C(=O)c1cc(Br)c(O)c(Br)c1