Reaction Details
TargetCytochrome P450 2C9
LigandBDBM50158460
Substrate/Competitorn/a
Meas. Tech.ChEMBL_461110 (CHEMBL945056)
Ki 19±n/a nM
Citation Hudelson, MGKetkar, NSHolder, LBCarlson, TJPeng, CCWaldher, BJJones, JP High confidence predictions of drug-drug interactions: predicting affinities for cytochrome P450 2C9 with multiple computational methods. J Med Chem51:648-54 (2008) 
 
Cytochrome P450 2C9
Name:Cytochrome P450 2C9
Type:Enzyme
Mol. Mass.:55636.33
Organism:Homo sapiens (Human)
Description:P11712
Residue:490
BDBM50158460
NameBDBM50158460
Synonyms:(3,5-dibromo-4-hydroxyphenyl)(2-ethyl-1-benzofuran-3-yl)methanone 3,5-dibromo-4-hydroxyphenyl-2-ethyl-3-benzofuranyl ketone CHEMBL388590 US9856239, benzbromarone Uroleap (TN) | cid_2333
TypeSmall organic molecule
Emp. Form.C17H12Br2O3
Mol. Mass.424.083
SMILESCCc1oc2ccccc2c1C(=O)c1cc(Br)c(O)c(Br)c1