Reaction Details
TargetProgesterone receptor
LigandBDBM50233026
Substrate/Competitorn/a
Meas. Tech.ChEMBL_462239 (CHEMBL945073)
IC50 4.3±n/a nM
Citation Dols, PPFolmer, BJHamersma, HKuil, CWLucas, HOllero, LRewinkel, JBHermkens, PH SAR study of 2,3,4,14b-tetrahydro-1H-dibenzo[b,f]pyrido[1,2-d][1,4]oxazepines as progesterone receptor agonists. Bioorg Med Chem Lett18:1461-7 (2008) 
 
Progesterone receptor
Name:Progesterone receptor
Type:Protein
Mol. Mass.:98979.52
Organism:Homo sapiens (Human)
Description:P06401
Residue:933
BDBM50233026
NameBDBM50233026
Synonyms:CHEMBL403138 | N-((1S,13bR)-6-chloro-1,3,4,13b-tetrahydro-2H-9-oxa-4a-aza-tribenzo[a,c,e]cyclohepten-1-yl)-2,2,2-trifluoro-acetamide
TypeSmall organic molecule
Emp. Form.C19H16ClF3N2O2
Mol. Mass.396.791
SMILESFC(F)(F)C(=O)N[C@H]1CCCN2[C@@H]1c1ccccc1Oc1ccc(Cl)cc21