Reaction Details
TargetMelanocortin receptor 4
LigandBDBM50235751
Substrate/Competitorn/a
Meas. Tech.ChEMBL_462736 (CHEMBL928657)
EC50 3500±n/a nM
Citation Tran, JATucci, FCArellano, MJiang, WChen, CWMarinkovic, DFleck, BAWen, JFoster, ACChen, C Design and synthesis of 3-arylpyrrolidine-2-carboxamide derivatives as melanocortin-4 receptor ligands. Bioorg Med Chem Lett18:1931-8 (2008) 
 
Melanocortin receptor 4
Name:Melanocortin receptor 4
Type:Enzyme
Mol. Mass.:36949.50
Organism:Homo sapiens (Human)
Description:P32245
Residue:332
BDBM50235751
NameBDBM50235751
Synonyms:CHEMBL255007 | {4-[2-((S)-1-amino-2-methyl-propyl)-4-methyl-phenyl]-piperazin-1-yl}-[(2R,3R)-3-(4-chloro-phenyl)-1-((R)-1,2,3,4-tetrahydro-isoquinoline-3-carbonyl)-pyrrolidin-2-yl]-methanone
TypeSmall organic molecule
Emp. Form.C36H44ClN5O2
Mol. Mass.614.22
SMILESCC(C)[C@H](N)c1cc(C)ccc1N1CCN(CC1)C(=O)[C@H]1[C@H](CCN1C(=O)[C@H]1Cc2ccccc2CN1)c1ccc(Cl)cc1