Reaction Details
TargetAdenosine receptor A1
LigandBDBM50030271
Substrate/Competitorn/a
Meas. Tech.ChEMBL_548098 (CHEMBL1033447)
Ki 2940±n/a nM
Citation Eder, CSchupp, PProksch, PWray, VSteube, KMüller, CEFrobenius, WHerderich, Mvan Soest, RW Bioactive pyridoacridine alkaloids from the micronesian sponge Oceanapia sp. J Nat Prod61:301-5 (1998) 
 
Adenosine receptor A1
Name:Adenosine receptor A1
Type:Protein
Mol. Mass.:36704.13
Organism:Rattus norvegicus (rat)
Description:n/a
Residue:326
BDBM50030271
NameBDBM50030271
Synonyms:CHEMBL127872 kuanoniamine D
TypeSmall organic molecule
Emp. Form.C20H16N4OS
Mol. Mass.360.432
SMILESCC(=O)NCCc1c2scnc2c2nccc3c4ccccc4[nH]c1c23