Reaction Details
TargetAdenosine receptor A2a
LigandBDBM50030271
Substrate/Competitorn/a
Meas. Tech.ChEMBL_548101 (CHEMBL1033450)
Ki 13700±n/a nM
Citation Eder, CSchupp, PProksch, PWray, VSteube, KMüller, CEFrobenius, WHerderich, Mvan Soest, RW Bioactive pyridoacridine alkaloids from the micronesian sponge Oceanapia sp. J Nat Prod61:301-5 (1998) 
 
Adenosine receptor A2a
Name:Adenosine receptor A2a
Type:G Protein-Coupled Receptor (GPCR)
Mol. Mass.:45015.65
Organism:Rattus norvegicus (rat)
Description:Rat A2A receptors expressed in CHO cells.
Residue:410
BDBM50030271
NameBDBM50030271
Synonyms:CHEMBL127872 kuanoniamine D
TypeSmall organic molecule
Emp. Form.C20H16N4OS
Mol. Mass.360.432
SMILESCC(=O)NCCc1c2scnc2c2nccc3c4ccccc4[nH]c1c23