Reaction Details
TargetAdenosine receptor A2a
LigandBDBM10847
Substrate/Competitorn/a
Meas. Tech.ChEMBL_548101 (CHEMBL1033450)
Ki 22000±n/a nM
Citation Eder, CSchupp, PProksch, PWray, VSteube, KMüller, CEFrobenius, WHerderich, Mvan Soest, RW Bioactive pyridoacridine alkaloids from the micronesian sponge Oceanapia sp. J Nat Prod61:301-5 (1998) 
 
Adenosine receptor A2a
Name:Adenosine receptor A2a
Type:G Protein-Coupled Receptor (GPCR)
Mol. Mass.:45015.65
Organism:Rattus norvegicus (rat)
Description:Rat A2A receptors expressed in CHO cells.
Residue:410
BDBM10847
NameBDBM10847
Synonyms:1,3-dimethyl-2,3,6,7-tetrahydro-1H-purine-2,6-dione Afonilum Aminophylline Cardophyllin Theophy-lline Theophylline (1,3-dimethylxanthine)
TypeSmall organic molecule
Emp. Form.C7H8N4O2
Mol. Mass.180.164
SMILESCn1c2nc[nH]c2c(=O)n(C)c1=O