Reaction Details
TargetAdenosine receptor A1
LigandBDBM10849
Substrate/Competitorn/a
Meas. Tech.ChEMBL_548098 (CHEMBL1033447)
Ki 17000±n/a nM
Citation Eder, CSchupp, PProksch, PWray, VSteube, KMüller, CEFrobenius, WHerderich, Mvan Soest, RW Bioactive pyridoacridine alkaloids from the micronesian sponge Oceanapia sp. J Nat Prod61:301-5 (1998) 
 
Adenosine receptor A1
Name:Adenosine receptor A1
Type:Protein
Mol. Mass.:36704.13
Organism:Rattus norvegicus (rat)
Description:n/a
Residue:326
BDBM10849
NameBDBM10849
Synonyms:1,3,7-trimethyl-2,3,6,7-tetrahydro-1H-purine-2,6-dione CHEMBL113 caffeine
TypeSmall organic molecule
Emp. Form.C8H10N4O2
Mol. Mass.194.1906
SMILESCn1cnc2n(C)c(=O)n(C)c(=O)c12