Reaction Details
TargetTrypsin
LigandBDBM50269532
Substrate/Competitorn/a
Meas. Tech.ChEMBL_550822 (CHEMBL995689)
IC50>200000±n/a nM
Citation Wang, DGirard, TJKasten, TPLaChance, RMMiller-Wideman, MADurley, RC Inhibitory activity of unsaturated fatty acids and anacardic acids toward soluble tissue factor-factor VIIa complex. J Nat Prod61:1352-5 (1999) 
 
Trypsin
Name:Trypsin
Synonyms:TRYP_PIG
Type:PROTEIN
Mol. Mass.:24411.24
Organism:Sus scrofa
Description:ChEMBL_1450738
Residue:231
BDBM50269532
NameBDBM50269532
TypeSmall organic molecule
Emp. Form.C18H30O2
Mol. Mass.278.4296
SMILESCCCCC\C=C/C\C=C/C\C=C/CCCCC(O)=O