Reaction Details
TargetTissue factor
LigandBDBM50242349
Substrate/Competitorn/a
Meas. Tech.ChEMBL_550824 (CHEMBL995691)
IC50 78000±n/a nM
Citation Wang, DGirard, TJKasten, TPLaChance, RMMiller-Wideman, MADurley, RC Inhibitory activity of unsaturated fatty acids and anacardic acids toward soluble tissue factor-factor VIIa complex. J Nat Prod61:1352-5 (1999) 
 
Tissue factor
Name:Tissue factor
Type:PROTEIN
Mol. Mass.:33067.61
Organism:Homo sapiens (Human)
Description:ChEMBL_936735
Residue:295
BDBM50242349
NameBDBM50242349
Synonyms:(5Z,8Z,11Z,14Z,17Z)-5,8,11,14,17-eicosapentaenoic acid (all-Z)-5,8,11,14,17-eicosapentaenoic acid 5Z,8Z,11Z,14Z,17Z-eicosapentaenoic acid EPA Icosapent all-cis-icosa-5,8,11,14,17-pentaenoic acid cis-Delta(5,8,11,14,17)-eicosapentaenoic acid vascepa
TypeSmall organic molecule
Emp. Form.C20H30O2
Mol. Mass.302.451
SMILESCC\C=C/C\C=C/C\C=C/C\C=C/C\C=C/CCCC(O)=O