Reaction Details
TargetProthrombin
LigandBDBM50269544
Substrate/Competitorn/a
Meas. Tech.ChEMBL_550848 (CHEMBL1007647)
IC50 70±n/a nM
Citation Dong, HChen, SXKini, RMXu, HX Effects of tannins from Geum japonicum on the catalytic activity of thrombin and factor Xa of blood coagulation cascade. J Nat Prod61:1356-60 (1999) 
 
Prothrombin
Name:Prothrombin
Type:Enzyme
Mol. Mass.:70502.73
Organism:Bos taurus (Bovine)
Description:P00735
Residue:625
BDBM50269544
NameBDBM50269544
Synonyms:CHEMBL510512 | tellimagrandin II
TypeSmall organic molecule
Emp. Form.C41H30O26
Mol. Mass.938.6613
SMILESOc1cc(cc(O)c1O)C(=O)OC1O[C@@H]2COC(=O)c3cc(O)c(O)c(O)c3-c3c(O)c(O)c(O)cc3C(=O)O[C@H]2[C@H](OC(=O)c2cc(O)c(O)c(O)c2)[C@H]1OC(=O)c1cc(O)c(O)c(O)c1