Reaction Details
TargetDNA topoisomerase 2-alpha
LigandBDBM50269149
Substrate/Competitorn/a
Meas. Tech.ChEMBL_527658 (CHEMBL971259)
IC50 8900±n/a nM
Citation Ma, ZZHano, YNomura, TChen, YJ Three new triterpenoids from Peganum nigellastrum. J Nat Prod63:390-2 (2000) DNA topoisomerase 2-alpha
Name:DNA topoisomerase 2-alpha
Type:Protein
Mol. Mass.:174415.30
Organism:Homo sapiens (Human)
Description:P11388
Residue:1531
BDBM50269149
NameBDBM50269149
Synonyms:3alpha,27-dihydroxylup-20(29)-en-28-oic acid methyl ester | CHEMBL525784
TypeSmall organic molecule
Emp. Form.C31H50O4
Mol. Mass.486.7263
SMILESCOC(=O)[C@]12CC[C@H]([C@@H]1[C@H]1CC[C@@H]3[C@@]4(C)CC[C@@H](O)C(C)(C)[C@@H]4CC[C@@]3(C)[C@]1(CO)CC2)C(C)=C