Reaction Details
TargetD(1A) dopamine receptor
LigandBDBM50202318
Substrate/Competitorn/a
Meas. Tech.ChEMBL_527724 (CHEMBL975083)
IC50 400±n/a nM
Citation Sobarzo-Sánchez, EMArbaoui, JProtais, PCassels, BK Halogenated boldine derivatives with enhanced monoamine receptor selectivity. J Nat Prod63:480-4 (2000) D(1A) dopamine receptor
Name:D(1A) dopamine receptor
Type:Enzyme Catalytic Domain
Mol. Mass.:49429.75
Organism:RAT
Description:P18901
Residue:446
BDBM50202318
NameBDBM50202318
Synonyms:(+)-boldine (S)-1,10-dimethoxy-6-methyl-5,6,6a,7-tetrahydro-4H-dibenzo[de,g]quinoline-2,9-diol boldine cid_248507
TypeSmall organic molecule
Emp. Form.C19H21NO4
Mol. Mass.327.3743
SMILESCOc1cc-2c(C[C@@H]3N(C)CCc4cc(O)c(OC)c-2c34)cc1O