Reaction Details
TargetAcetylcholinesterase
LigandBDBM50269180
Substrate/Competitorn/a
Meas. Tech.ChEMBL_529395 (CHEMBL974116)
IC50 86000±n/a nM
Citation Ingkaninan, KHazekamp, Ade Best, CMIrth, HTjaden, URvan der Heijden, Rvan der Greef, JVerpoorte, R The application of HPLC with on-line coupled UV/MS-biochemical detection for isolation of an acetylcholinesterase inhibitor from narcissus 'Sir Winston Churchill'. J Nat Prod63:803-6 (2000) Acetylcholinesterase
Name:Acetylcholinesterase
Type:Enzyme
Mol. Mass.:67792.70
Organism:Homo sapiens (Human)
Description:P22303
Residue:614
BDBM50269180
NameBDBM50269180
Synonyms:CHEMBL497276 | ungiminorine
TypeSmall organic molecule
Emp. Form.C17H19NO5
Mol. Mass.317.3365
SMILESCO[C@@H]1[C@@H](O)[C@@H]2[C@@H]3N(CC=C3[C@H]1O)Cc1cc3OCOc3cc21