Reaction Details
TargetProstaglandin G/H synthase 1
LigandBDBM50259651
Substrate/Competitorn/a
Meas. Tech.ChEMBL_506875 (CHEMBL947576)
IC50 4300±n/a nM
Citation Waffo-Teguo, PLee, DCuendet, MMérillon, JPezzuto, JMKinghorn, AD Two new stilbene dimer glucosides from grape (Vitis vinifera) cell cultures. J Nat Prod64:136-8 (2001) Prostaglandin G/H synthase 1
Name:Prostaglandin G/H synthase 1
Type:Enzyme
Mol. Mass.:68692.62
Organism:Homo sapiens (Human)
Description:P23219
Residue:599
BDBM50259651
NameBDBM50259651
Synonyms:CHEMBL518935 resveratrol trans-dehydrodimer
TypeSmall organic molecule
Emp. Form.C28H22O6
Mol. Mass.454.4707
SMILESOc1ccc(cc1)[C@H]1Oc2ccc(\C=C\c3cc(O)cc(O)c3)cc2[C@@H]1c1cc(O)cc(O)c1