Reaction Details
TargetProstaglandin G/H synthase 1
LigandBDBM50269812
Substrate/Competitorn/a
Meas. Tech.ChEMBL_506875 (CHEMBL947576)
IC50 5200±n/a nM
Citation Waffo-Teguo, PLee, DCuendet, MMérillon, JPezzuto, JMKinghorn, AD Two new stilbene dimer glucosides from grape (Vitis vinifera) cell cultures. J Nat Prod64:136-8 (2001) Prostaglandin G/H synthase 1
Name:Prostaglandin G/H synthase 1
Type:Enzyme
Mol. Mass.:68692.62
Organism:Homo sapiens (Human)
Description:P23219
Residue:599
BDBM50269812
NameBDBM50269812
Synonyms:CHEMBL503412 | resveratrol (E)-dehydrodimer 11-O-beta-D-glucopyranoside
TypeSmall organic molecule
Emp. Form.C34H32O11
Mol. Mass.616.6113
SMILESOC[C@H]1O[C@@H](Oc2cc(O)cc(c2)[C@@H]2[C@H](Oc3ccc(\C=C\c4cc(O)cc(O)c4)cc23)c2ccc(O)cc2)[C@H](O)[C@@H](O)[C@@H]1O