Reaction Details
TargetProstaglandin G/H synthase 2
LigandBDBM50259651
Substrate/Competitorn/a
Meas. Tech.ChEMBL_506876 (CHEMBL947577)
IC50 3700±n/a nM
Citation Waffo-Teguo, PLee, DCuendet, MMérillon, JPezzuto, JMKinghorn, AD Two new stilbene dimer glucosides from grape (Vitis vinifera) cell cultures. J Nat Prod64:136-8 (2001) Prostaglandin G/H synthase 2
Name:Prostaglandin G/H synthase 2
Type:Enzyme
Mol. Mass.:69003.89
Organism:Homo sapiens (Human)
Description:Recombinant Cox-2 provided by Cayman (Cayman Chemical Co.,Ann Arbor, MI).
Residue:604
BDBM50259651
NameBDBM50259651
Synonyms:CHEMBL518935 resveratrol trans-dehydrodimer
TypeSmall organic molecule
Emp. Form.C28H22O6
Mol. Mass.454.4707
SMILESOc1ccc(cc1)[C@H]1Oc2ccc(\C=C\c3cc(O)cc(O)c3)cc2[C@@H]1c1cc(O)cc(O)c1