Reaction Details
TargetType II restriction enzyme BamHI
LigandBDBM50164888
Substrate/Competitorn/a
Meas. Tech.ChEMBL_509274 (CHEMBL996018)
IC50>400000±n/a nM
Citation Suzuki, KYahara, SMaehata, KUyeda, M Isoaurostatin, a novel topoisomerase inhibitor produced by Thermomonospora alba. J Nat Prod64:204-7 (2001) Type II restriction enzyme BamHI
Name:Type II restriction enzyme BamHI
Type:PROTEIN
Mol. Mass.:24567.99
Organism:Bacillus amyloliquefaciens
Description:ChEMBL_509274
Residue:213
BDBM50164888
NameBDBM50164888
Synonyms:6-Hydroxy-3-[1-(4-hydroxy-phenyl)-meth-(E)-ylidene]-3H-benzofuran-2-one isoaurostatin
TypeSmall organic molecule
Emp. Form.C15H10O4
Mol. Mass.254.2375
SMILESOc1ccc(\C=C2\C(=O)Oc3cc(O)ccc23)cc1