Reaction Details
TargetRibonuclease pancreatic
LigandBDBM22984
Substrate/Competitorn/a
Meas. Tech.ChEMBL_509268 (CHEMBL996012)
IC50 25000±n/a nM
Citation Suzuki, KYahara, SMaehata, KUyeda, M Isoaurostatin, a novel topoisomerase inhibitor produced by Thermomonospora alba. J Nat Prod64:204-7 (2001) Ribonuclease pancreatic
Name:Ribonuclease pancreatic
Type:Enzyme
Mol. Mass.:16468.79
Organism:Bison bison (American bison)
Description:carboxamidomethylated RNase A
Residue:150
BDBM22984
NameBDBM22984
Synonyms:(8S,10S)-10-{[(2R,4S,5S,6S)-4-amino-5-hydroxy-6-methyloxan-2-yl]oxy}-6,8,11-trihydroxy-8-(2-hydroxyacetyl)-1-methoxy-5,7,8,9,10,12-hexahydrotetracene-5,12-dione Adriblastina Doxil | Doxorubicin
TypeAntibiotic
Emp. Form.C27H29NO11
Mol. Mass.543.5193
SMILESCOc1cccc2C(=O)c3c(O)c4C[C@](O)(C[C@H](O[C@H]5C[C@H](N)[C@H](O)[C@H](C)O5)c4c(O)c3C(=O)c12)C(=O)CO