Reaction Details
TargetCholinesterase
LigandBDBM50250635
Substrate/Competitorn/a
Meas. Tech.ChEMBL_503947 (CHEMBL985794)
IC50 53700±n/a nM
Citation Choudhary, MIShahnaz, SParveen, SKhalid, AMajeed Ayatollahi, SAAtta-Ur-Rahman, AParvez, M New triterpenoid alkaloid cholinesterase inhibitors from Buxus hyrcana. J Nat Prod66:739-42 (2003) 
 
Cholinesterase
Name:Cholinesterase
Type:Homotetramer
Mol. Mass.:68422.27
Organism:Homo sapiens (Human)
Description:P06276
Residue:602
BDBM50250635
NameBDBM50250635
Synonyms:CHEMBL517605 | [(20S)-20-(dimethylamino)-3-beta-(2'-methylpropanoyl)bux-9(11)-en-10-alpha-ol]
TypeSmall organic molecule
Emp. Form.C30H52N2O2
Mol. Mass.472.7461
SMILESCC(C)C(=O)N[C@H]1CC[C@]2(O)CC3=CC[C@]4(C)[C@H](CC[C@@]4(C)[C@@H]3CC[C@H]2C1(C)C)[C@H](C)N(C)C