Reaction Details
TargetCyclin-dependent kinase 5
LigandBDBM7462
Substrate/Competitorn/a
Meas. Tech.ChEMBL_548295 (CHEMBL1028365)
EC50 66100±n/a nM
Citation Zapata-Torres, GOpazo, FSalgado, CMuñoz, JPKrautwurst, HMascayano, CSepúlveda-Boza, SMaccioni, RBCassels, BK Effects of natural flavones and flavonols on the kinase activity of Cdk5. J Nat Prod67:416-20 (2004) 
 
Cyclin-dependent kinase 5
Name:Cyclin-dependent kinase 5
Type:PROTEIN
Mol. Mass.:33258.60
Organism:Rattus norvegicus
Description:ChEMBL_548295
Residue:292
BDBM7462
NameBDBM7462
Synonyms:3,5,7-trihydroxy-2-(4-hydroxyphenyl)-4H-chromen-4-one CHEMBL150 Kaempferol (Kmp) kaempferol
TypeSmall organic molecule
Emp. Form.C15H10O6
Mol. Mass.286.2363
SMILESOc1ccc(cc1)-c1oc2cc(O)cc(O)c2c(=O)c1O