Reaction Details
TargetCholinesterase
LigandBDBM50269614
Substrate/Competitorn/a
Meas. Tech.ChEMBL_552087 (CHEMBL999151)
IC50 11200±n/a nM
Citation Becher, PGBeuchat, JGademann, KJüttner, F Nostocarboline: isolation and synthesis of a new cholinesterase inhibitor from Nostoc 78-12A. J Nat Prod68:1793-5 (2005) 
 
Cholinesterase
Name:Cholinesterase
Type:Enzyme
Mol. Mass.:65643.35
Organism:Equus caballus (Horse)
Description:P81908
Residue:574
BDBM50269614
NameBDBM50269614
Synonyms:2-Methyl-beta-carboline-2-ium iodide 2-methylnorharmane iodide | CHEMBL455600
TypeSmall organic molecule
Emp. Form.C12H11N2
Mol. Mass.183.2286
SMILESC[n+]1ccc2c(c1)[nH]c1ccccc21