Reaction Details
TargetEpidermal growth factor receptor
LigandBDBM50042949
Substrate/Competitorn/a
Meas. Tech.ChEMBL_526697 (CHEMBL970971)
IC50 8000±n/a nM
Citation McArdle, BMCampitelli, MRQuinn, RJ A common protein fold topology shared by flavonoid biosynthetic enzymes and therapeutic targets. J Nat Prod69:14-7 (2006) 
 
Epidermal growth factor receptor
Name:Epidermal growth factor receptor
Type:Receptor Kinase Domain
Mol. Mass.:134279.59
Organism:Homo sapiens (Human)
Description:P00533
Residue:1210
BDBM50042949
NameBDBM50042949
Synonyms:(E)-1-(2,4-dihydroxyphenyl)-3-(3,4-dihydroxyphenyl)-2-propen-1-one (21) (E)-3-(3,4-Dihydroxy-phenyl)-1-(2,4-dihydroxy-phenyl)-propenone 3-(3,4-Dihydroxy-phenyl)-1-(2,4-dihydroxy-phenyl)-propenone CHEMBL128000
TypeSmall organic molecule
Emp. Form.C15H12O5
Mol. Mass.272.2528
SMILESOc1ccc(C(=O)\C=C\c2ccc(O)c(O)c2)c(O)c1