Reaction Details
TargetEpidermal growth factor receptor
LigandBDBM50250286
Substrate/Competitorn/a
Meas. Tech.ChEMBL_526697 (CHEMBL970971)
IC50 19000000±n/a nM
Citation McArdle, BMCampitelli, MRQuinn, RJ A common protein fold topology shared by flavonoid biosynthetic enzymes and therapeutic targets. J Nat Prod69:14-7 (2006) 
 
Epidermal growth factor receptor
Name:Epidermal growth factor receptor
Type:Receptor Kinase Domain
Mol. Mass.:134279.59
Organism:Homo sapiens (Human)
Description:P00533
Residue:1210
BDBM50250286
NameBDBM50250286
Synonyms:CHEMBL490510 | Marein
TypeSmall organic molecule
Emp. Form.C21H22O11
Mol. Mass.450.3928
SMILESOC[C@H]1O[C@@H](Oc2ccc(C(=O)\C=C\c3ccc(O)c(O)c3)c(O)c2O)[C@H](O)[C@@H](O)[C@@H]1O