Reaction Details
Target5-hydroxytryptamine receptor 2C
LigandBDBM50031942
Substrate/Competitorn/a
Meas. Tech.ChEMBL_526857 (CHEMBL979352)
Ki 2.5±n/a nM
Citation Hedner, ESjögren, MFrändberg, PAJohansson, TGöransson, UDahlström, MJonsson, PNyberg, FBohlin, L Brominated cyclodipeptides from the marine sponge Geodia barretti as selective 5-HT ligands. J Nat Prod69:1421-4 (2006) 
 
5-hydroxytryptamine receptor 2C
Name:5-hydroxytryptamine receptor 2C
Type:G Protein-Coupled Receptor (GPCR)
Mol. Mass.:51836.79
Organism:Homo sapiens (Human)
Description:P28335
Residue:458
BDBM50031942
NameBDBM50031942
Synonyms:(6aR,9R)-4,6a,7-Trimethyl-4,6,6a,7,8,9-hexahydro-indolo[4,3-fg]quinoline-9-carboxylic acid (1-hydroxymethyl-propyl)-amide (6aR,9R)-4-Methyl-4,6,6a,7,8,9-hexahydro-indolo[4,3-fg]quinoline-9-carboxylic acid (1-hydroxymethyl-propyl)-amide (methylsergide)4,7-Dimethyl-4,6,6a,7,8,9-hexahydro-indolo[4,3-fg]quinoline-9-carboxylic acid (1-hydroxymethyl-propyl)-amide CHEMBL1065 Sansert
TypeSmall organic molecule
Emp. Form.C21H27N3O2
Mol. Mass.353.458
SMILESCC[C@@H](CO)NC(=O)[C@H]1CN(C)[C@@H]2Cc3cn(C)c4cccc(C2=C1)c34