Reaction Details
TargetIntegrin alpha-V
LigandBDBM50260255
Substrate/Competitorn/a
Meas. Tech.ChEMBL_504851 (CHEMBL983998)
IC50 28700±n/a nM
Citation DiCara, DRapisarda, CSutcliffe, JLViolette, SMWeinreb, PHHart, IRHoward, MJMarshall, JF Structure-function analysis of Arg-Gly-Asp helix motifs in alpha v beta 6 integrin ligands. J Biol Chem282:9657-65 (2007) 
 
Integrin alpha-V
Name:Integrin alpha-V
Type:PROTEIN
Mol. Mass.:116024.92
Organism:Homo sapiens (Human)
Description:ChEMBL_582336
Residue:1048
BDBM50260255
NameBDBM50260255
Synonyms:CHEMBL526119 | GFTTGRRGDLATIHGMNRPF
TypeSmall organic molecule
Emp. Form.C95H150N32O27S
Mol. Mass.2204.471
SMILESCC[C@H](C)[C@H](NC(=O)[C@@H](NC(=O)[C@H](C)NC(=O)[C@H](CC(C)C)NC(=O)[C@H](CC(O)=O)NC(=O)CNC(=O)[C@H](CCCN=C(N)N)NC(=O)[C@H](CCCN=C(N)N)NC(=O)CNC(=O)[C@@H](NC(=O)[C@@H](NC(=O)[C@H](Cc1ccccc1)NC(=O)CN)[C@@H](C)O)[C@@H](C)O)[C@@H](C)O)C(=O)N[C@@H](Cc1cnc[nH]1)C(=O)NCC(=O)N[C@@H](CCSC)C(=O)N[C@@H](CC(N)=O)C(=O)N[C@@H](CCCN=C(N)N)C(=O)N1CCC[C@H]1C(=O)N[C@@H](Cc1ccccc1)C(O)=O