Reaction Details
TargetBeta-lactamase
LigandBDBM50240349
Substrate/Competitorn/a
Meas. Tech.ChEMBL_553112 (CHEMBL966142)
IC50 68±n/a nM
Citation Power, PDi Conza, JRodríguez, MMGhiglione, BAyala, JACasellas, JMRadice, MGutkind, G Biochemical characterization of PER-2 and genetic environment of blaPER-2. Antimicrob Agents Chemother51:2359-65 (2007) 
 
Beta-lactamase
Name:Beta-lactamase
Synonyms:PER-2 beta-lactamase
Type:PROTEIN
Mol. Mass.:33451.67
Organism:Citrobacter freundii
Description:ChEMBL_553112
Residue:308
BDBM50240349
NameBDBM50240349
TypeSmall organic molecule
Emp. Form.C8H8NO5
Mol. Mass.198.1534
SMILESOC\C=C1/O[C@@H]2CC(=O)N2[C@H]1C([O-])=O