Reaction Details
TargetEstrogen receptor beta
LigandBDBM50154119
Substrate/Competitorn/a
Meas. Tech.ChEMBL_530438 (CHEMBL973102)
IC50 3.6±n/a nM
Citation Luan, FLiu, HTMa, WPFan, BT Classification of estrogen receptor-beta ligands on the basis of their binding affinities using support vector machine and linear discriminant analysis. Eur J Med Chem43:43-52 (2008) 
 
Estrogen receptor beta
Name:Estrogen receptor beta
Type:Protein
Mol. Mass.:59238.43
Organism:Homo sapiens (Human)
Description:Q92731
Residue:530
BDBM50154119
NameBDBM50154119
Synonyms:3-(2-Ethyl-4-hydroxy-5-propyl-phenyl)-benzo[d]isoxazol-6-ol CHEMBL186598
TypeSmall organic molecule
Emp. Form.C18H19NO3
Mol. Mass.297.3484
SMILESCCCc1cc(-c2noc3cc(O)ccc23)c(CC)cc1O