Reaction Details
TargetEstrogen receptor beta
LigandBDBM50242647
Substrate/Competitorn/a
Meas. Tech.ChEMBL_530438 (CHEMBL973102)
IC50 1.4±n/a nM
Citation Luan, FLiu, HTMa, WPFan, BT Classification of estrogen receptor-beta ligands on the basis of their binding affinities using support vector machine and linear discriminant analysis. Eur J Med Chem43:43-52 (2008) 
 
Estrogen receptor beta
Name:Estrogen receptor beta
Type:Protein
Mol. Mass.:59238.43
Organism:Homo sapiens (Human)
Description:Q92731
Residue:530
BDBM50242647
NameBDBM50242647
Synonyms:7-bromo-2-(4-hydroxy-2-(trifluoromethyl)phenyl)benzo[d]oxazol-5-ol | CHEMBL510754
TypeSmall organic molecule
Emp. Form.C14H7BrF3NO3
Mol. Mass.374.109
SMILESOc1ccc(-c2nc3cc(O)cc(Br)c3o2)c(c1)C(F)(F)F