Reaction Details
TargetEstrogen receptor beta
LigandBDBM50154047
Substrate/Competitorn/a
Meas. Tech.ChEMBL_530438 (CHEMBL973102)
IC50 3.7±n/a nM
Citation Luan, FLiu, HTMa, WPFan, BT Classification of estrogen receptor-beta ligands on the basis of their binding affinities using support vector machine and linear discriminant analysis. Eur J Med Chem43:43-52 (2008) 
 
Estrogen receptor beta
Name:Estrogen receptor beta
Type:Protein
Mol. Mass.:59238.43
Organism:Homo sapiens (Human)
Description:Q92731
Residue:530
BDBM50154047
NameBDBM50154047
Synonyms:2-(2,3-Difluoro-4-hydroxy-phenyl)-7-vinyl-benzooxazol-5-ol CHEMBL363963
TypeSmall organic molecule
Emp. Form.C15H9F2NO3
Mol. Mass.289.2337
SMILESOc1cc(C=C)c2oc(nc2c1)-c1ccc(O)c(F)c1F