Reaction Details
TargetProprotein convertase subtilisin/kexin type 5
LigandBDBM50270060
Substrate/Competitorn/a
Meas. Tech.ChEMBL_508166 (CHEMBL1008224)
Ki 188±n/a nM
Citation Shiryaev, SARemacle, AGRatnikov, BINelson, NASavinov, AYWei, GBottini, MRega, MFParent, ADesjardins, RFugere, MDay, RSabet, MPellecchia, MLiddington, RCSmith, JWMustelin, TGuiney, DGLebl, MStrongin, AY Targeting host cell furin proprotein convertases as a therapeutic strategy against bacterial toxins and viral pathogens. J Biol Chem282:20847-53 (2007) 
 
Proprotein convertase subtilisin/kexin type 5
Name:Proprotein convertase subtilisin/kexin type 5
Type:PROTEIN
Mol. Mass.:206919.79
Organism:Homo sapiens (Human)
Description:ChEMBL_597565
Residue:1860
BDBM50270060
NameBDBM50270060
Synonyms:CHEMBL455792 | TPQRARRRKKRT
TypeSmall organic molecule
Emp. Form.C63H120N30O16
Mol. Mass.1553.8183
SMILES[#6]-[#6@@H](-[#8])-[#6@H](-[#7])-[#6](=O)-[#7]-1-[#6]-[#6]-[#6]-[#6@H]-1-[#6](=O)-[#7]-[#6@@H](-[#6]-[#6]-[#6](-[#7])=O)-[#6](=O)-[#7]-[#6@@H](-[#6]-[#6]-[#6]\[#7]=[#6](/[#7])-[#7])-[#6](=O)-[#7]-[#6@@H](-[#6])-[#6](=O)-[#7]-[#6@@H](-[#6]-[#6]-[#6]\[#7]=[#6](/[#7])-[#7])-[#6](=O)-[#7]-[#6@@H](-[#6]-[#6]-[#6]\[#7]=[#6](/[#7])-[#7])-[#6](=O)-[#7]-[#6@@H](-[#6]-[#6]-[#6]\[#7]=[#6](/[#7])-[#7])-[#6](=O)-[#7]-[#6@@H](-[#6]-[#6]-[#6]-[#6]-[#7])-[#6](=O)-[#7]-[#6@@H](-[#6]-[#6]-[#6]-[#6]-[#7])-[#6](=O)-[#7]-[#6@@H](-[#6]-[#6]-[#6]\[#7]=[#6](/[#7])-[#7])-[#6](=O)-[#7]-[#6@@H](-[#6@@H](-[#6])-[#8])-[#6](-[#8])=O