Reaction Details
TargetProprotein convertase subtilisin/kexin type 5
LigandBDBM50270067
Substrate/Competitorn/a
Meas. Tech.ChEMBL_508166 (CHEMBL1008224)
Ki 433±n/a nM
Citation Shiryaev, SARemacle, AGRatnikov, BINelson, NASavinov, AYWei, GBottini, MRega, MFParent, ADesjardins, RFugere, MDay, RSabet, MPellecchia, MLiddington, RCSmith, JWMustelin, TGuiney, DGLebl, MStrongin, AY Targeting host cell furin proprotein convertases as a therapeutic strategy against bacterial toxins and viral pathogens. J Biol Chem282:20847-53 (2007) 
 
Proprotein convertase subtilisin/kexin type 5
Name:Proprotein convertase subtilisin/kexin type 5
Type:PROTEIN
Mol. Mass.:206919.79
Organism:Homo sapiens (Human)
Description:ChEMBL_597565
Residue:1860
BDBM50270067
NameBDBM50270067
Synonyms:CHEMBL503520 | TPQRARRRKKRW
TypeSmall organic molecule
Emp. Form.C70H123N31O15
Mol. Mass.1638.9243
SMILESC[C@@H](O)[C@H](N)C(=O)N1CCC[C@H]1C(=O)N[C@@H](CCC(N)=O)C(=O)N[C@@H](CCCN=C(N)N)C(=O)N[C@@H](C)C(=O)N[C@@H](CCCN=C(N)N)C(=O)N[C@@H](CCCN=C(N)N)C(=O)N[C@@H](CCCN=C(N)N)C(=O)N[C@@H](CCCCN)C(=O)N[C@@H](CCCCN)C(=O)N[C@@H](CCCN=C(N)N)C(=O)N[C@@H](Cc1c[nH]c2ccccc12)C(O)=O