Reaction Details
TargetProprotein convertase subtilisin/kexin type 7
LigandBDBM50270068
Substrate/Competitorn/a
Meas. Tech.ChEMBL_508167 (CHEMBL1008225)
Ki 1133±n/a nM
Citation Shiryaev, SARemacle, AGRatnikov, BINelson, NASavinov, AYWei, GBottini, MRega, MFParent, ADesjardins, RFugere, MDay, RSabet, MPellecchia, MLiddington, RCSmith, JWMustelin, TGuiney, DGLebl, MStrongin, AY Targeting host cell furin proprotein convertases as a therapeutic strategy against bacterial toxins and viral pathogens. J Biol Chem282:20847-53 (2007) 
 
Proprotein convertase subtilisin/kexin type 7
Name:Proprotein convertase subtilisin/kexin type 7
Type:PROTEIN
Mol. Mass.:86233.43
Organism:Homo sapiens (Human)
Description:ChEMBL_1290739
Residue:785
BDBM50270068
NameBDBM50270068
Synonyms:CHEMBL500184 | TPQRARRRKKRF
TypeSmall organic molecule
Emp. Form.C68H122N30O15
Mol. Mass.1599.8883
SMILES[#6]-[#6@@H](-[#8])-[#6@H](-[#7])-[#6](=O)-[#7]-1-[#6]-[#6]-[#6]-[#6@H]-1-[#6](=O)-[#7]-[#6@@H](-[#6]-[#6]-[#6](-[#7])=O)-[#6](=O)-[#7]-[#6@@H](-[#6]-[#6]-[#6]\[#7]=[#6](/[#7])-[#7])-[#6](=O)-[#7]-[#6@@H](-[#6])-[#6](=O)-[#7]-[#6@@H](-[#6]-[#6]-[#6]\[#7]=[#6](/[#7])-[#7])-[#6](=O)-[#7]-[#6@@H](-[#6]-[#6]-[#6]\[#7]=[#6](/[#7])-[#7])-[#6](=O)-[#7]-[#6@@H](-[#6]-[#6]-[#6]\[#7]=[#6](/[#7])-[#7])-[#6](=O)-[#7]-[#6@@H](-[#6]-[#6]-[#6]-[#6]-[#7])-[#6](=O)-[#7]-[#6@@H](-[#6]-[#6]-[#6]-[#6]-[#7])-[#6](=O)-[#7]-[#6@@H](-[#6]-[#6]-[#6]\[#7]=[#6](/[#7])-[#7])-[#6](=O)-[#7]-[#6@@H](-[#6]-c1ccccc1)-[#6](-[#8])=O