Reaction Details
TargetCathepsin D
LigandBDBM577
Substrate/Competitorn/a
Meas. Tech.ChEMBL_522624 (CHEMBL996242)
IC50 15200±n/a nM
Citation Dandache, SSévigny, GYelle, JStranix, BRParkin, NSchapiro, JMWainberg, MAWu, JJ In vitro antiviral activity and cross-resistance profile of PL-100, a novel protease inhibitor of human immunodeficiency virus type 1. Antimicrob Agents Chemother51:4036-43 (2007) 
 
Cathepsin D
Name:Cathepsin D
Type:Enzyme
Mol. Mass.:44551.72
Organism:Homo sapiens (Human)
Description:Human proCathepsin D (SwissProt accession number P07339) was expressed in Sf9 cells, purified, and autoactivated.
Residue:412
BDBM577
NameBDBM577
Synonyms:(3S)-oxolan-3-yl N-[(2S,3R)-4-[(4-aminobenzene)(2-methylpropyl)sulfonamido]-3-hydroxy-1-phenylbutan-2-yl]carbamate APV Amprenavir CHEMBL116 | VX-478
TypeSmall organic molecule
Emp. Form.C25H35N3O6S
Mol. Mass.505.627
SMILESCC(C)CN(C[C@@H](O)[C@H](Cc1ccccc1)NC(=O)O[C@H]1CCOC1)S(=O)(=O)c1ccc(N)cc1