Reaction Details
TargetMetabotropic glutamate receptor 1
LigandBDBM50177079
Substrate/Competitorn/a
Meas. Tech.ChEMBL_511021 (CHEMBL999637)
IC50 20±n/a nM
Citation Nataraja Sekhar, YRavikumar, MRavi Shashi Nayana, MMallena, SCKishore Kumar, M 3D-QSAR studies of triazafluorenone inhibitors of metabotropic glutamate receptor subtype 1. Eur J Med Chem43:1025-34 (2008) 
 
Metabotropic glutamate receptor 1
Name:Metabotropic glutamate receptor 1
Type:Enzyme Catalytic Domain
Mol. Mass.:133240.47
Organism:RAT
Description:metabotropic glutamate 1/2 0 RAT::P23385
Residue:1199
BDBM50177079
NameBDBM50177079
Synonyms:9-dimethylamino-3-phenyl-3H-pyrido[3',2':4,5]thieno[3,2-d]pyrimidin-4-one | CHEMBL224615
TypeSmall organic molecule
Emp. Form.C17H14N4OS
Mol. Mass.322.384
SMILESCN(C)c1ccnc2sc3c(ncn(-c4ccccc4)c3=O)c12