Reaction Details
TargetSerine/threonine-protein kinase Chk1
LigandBDBM50245178
Substrate/Competitorn/a
Meas. Tech.ChEMBL_511069 (CHEMBL1000361)
IC50 1300±n/a nM
Citation Smaill, JBBaker, ENBooth, RJBridges, AJDickson, JMDobrusin, EMIvanovic, IKraker, AJLee, HHLunney, EAOrtwine, DFPalmer, BDQuin, JSquire, CJThompson, AMDenny, WA Synthesis and structure-activity relationships of N-6 substituted analogues of 9-hydroxy-4-phenylpyrrolo[3,4-c]carbazole-1,3(2H,6H)-diones as inhibitors of Wee1 and Chk1 checkpoint kinases. Eur J Med Chem43:1276-96 (2008) 
 
Serine/threonine-protein kinase Chk1
Name:Serine/threonine-protein kinase Chk1
Type:Enzyme Catalytic Domain
Mol. Mass.:54443.02
Organism:Homo sapiens (Human)
Description:gi_166295192
Residue:476
BDBM50245178
NameBDBM50245178
Synonyms:6-(3-(1H-imidazol-1-yl)propyl)-4-(2,6-dichlorophenyl)-9-hydroxypyrrolo[3,4-c]carbazole-1,3(2H,6H)-dione | CHEMBL452829
TypeSmall organic molecule
Emp. Form.C26H18Cl2N4O3
Mol. Mass.505.352
SMILESOc1ccc2n(CCCn3ccnc3)c3cc(c4C(=O)NC(=O)c4c3c2c1)-c1c(Cl)cccc1Cl